[M3devel] m3gdb status?

mika at async.caltech.edu mika at async.caltech.edu
Tue Aug 19 10:13:09 CEST 2014

What is the status of m3gdb?

I am on AMD64_LINUX here...head from CVS.

The error looks pedantic but the fact that things aren't building makes me think maybe this code is pretty dusty...?

/bin/sh ../../gdb/bfd/../move-if-change bfd-tmp.h bfd.h
rm -f bfd-tmp.h
touch stmp-bfd-h
/bin/sh ./libtool --mode=compile gcc -DHAVE_CONFIG_H -I. -I../../gdb/bfd -I. -I. -I../../gdb/bfd -I../../gdb/bfd/../include  -I../../gdb/bfd/../intl -I../intl   -W -Wall -Wstrict-prototypes -Wmissing-prototypes -Werror -g -O2  -c -o archive.lo ../../gdb/bfd/archive.c
gcc -DHAVE_CONFIG_H -I. -I../../gdb/bfd -I. -I. -I../../gdb/bfd -I../../gdb/bfd/../include -I../../gdb/bfd/../intl -I../intl -W -Wall -Wstrict-prototypes -Wmissing-prototypes -Werror -g -O2 -c ../../gdb/bfd/archive.c -o archive.o
../../gdb/bfd/archive.c: In function 'bfd_generic_archive_p':
../../gdb/bfd/archive.c:669:16: error: variable 'fail' set but not used [-Werror=unused-but-set-variable]
cc1: all warnings being treated as errors
make[4]: *** [archive.lo] Error 1
make[4]: Leaving directory `/big/home2/mika/2/cm3-cvs/cm3/m3-sys/m3gdb/AMD64_LINUX/bfd'
make[3]: *** [all-recursive] Error 1
make[3]: Leaving directory `/big/home2/mika/2/cm3-cvs/cm3/m3-sys/m3gdb/AMD64_LINUX/bfd'
make[2]: *** [all] Error 2
make[2]: Leaving directory `/big/home2/mika/2/cm3-cvs/cm3/m3-sys/m3gdb/AMD64_LINUX/bfd'
make[1]: *** [all-bfd] Error 2
make[1]: Leaving directory `/big/home2/mika/2/cm3-cvs/cm3/m3-sys/m3gdb/AMD64_LINUX'
make: *** [all] Error 2
"/big/home2/mika/2/cm3-cvs/cm3/m3-sys/m3gdb/src/m3makefile", line 40: quake runtime error: exit 2: make  MAKE=make  MAKEINFO=:

--procedure--  -line-  -file---
exec               --  <builtin>
m3gdb_Run          40  /big/home2/mika/2/cm3-cvs/cm3/m3-sys/m3gdb/src/m3makefile
include_dir        85  /big/home2/mika/2/cm3-cvs/cm3/m3-sys/m3gdb/src/m3makefile
                    4  /big/home2/mika/2/cm3-cvs/cm3/m3-sys/m3gdb/AMD64_LINUX/m3make.args

Fatal Error: package build failed

More information about the M3devel mailing list